Uploaded image for project: 'Erlang/OTP'
  1. Erlang/OTP
  2. ERL-1004

Erlang source code compilation has failed with an ERROR (rc.exe not found!)

    XMLWordPrintable

    Details

    • Type: Question
    • Status: Resolved
    • Priority: Major
    • Resolution: Done
    • Affects Version/s: 21.3
    • Fix Version/s: None
    • Component/s: crypto
    • Labels:
      None

      Description

      I am compiling the Erlang v21.3 Source code by following the instructions [1].

      [1] http://erlang.org/documentation/doc-10.3/doc/installation_guide/INSTALL-WIN32.html

      Howeever, ./otp_build boot -a command gives the below error and compilation has failed.

      Error :
      *make[4]: Entering directory '/cygdrive/d/Erlang/otp-OTP-21.3/erts/emulator'
      GEN win32/gen_git_version.mk
      CC obj/win32/opt/smp/erl_main.o
      RC obj/win32/opt/smp/beams.res
      rc.exe not found!
      make[4]: *** [win32/Makefile:705: obj/win32/opt/smp/beams.res] Error 1
      make[4]: Leaving directory '/cygdrive/d/Erlang/otp-OTP-21.3/erts/emulator'
      make[3]: *** [/cygdrive/d/Erlang/otp-OTP-21.3/make/run_make.mk:35: opt] Error 2
      make[3]: Leaving directory '/cygdrive/d/Erlang/otp-OTP-21.3/erts/emulator'
      make[2]: *** [Makefile:45: opt] Error 2
      make[2]: Leaving directory '/cygdrive/d/Erlang/otp-OTP-21.3/erts'
      make[1]: *** [Makefile:54: smp] Error 2
      make[1]: Leaving directory '/cygdrive/d/Erlang/otp-OTP-21.3/erts'
      make: *** [Makefile:481: emulator] Error 2*

      Please find the attached complete log file and snapshot for your reference.
      Please help me to resolve this issue.

      Thanks.

        Attachments

          Activity

            People

            Assignee:
            otp_team_vm Team VM
            Reporter:
            BadriRameshkumar Badri Ramesh
            Votes:
            0 Vote for this issue
            Watchers:
            2 Start watching this issue

              Dates

              Created:
              Updated:
              Resolved: